﻿2026-08-29T06:04:53.3697390Z ##[group]Run bash .github/bench/wrap.sh twohost-cli-b -- cargo test -p spt --test twohost_cli -- --nocapture
2026-08-29T06:04:53.3698023Z [36;1mbash .github/bench/wrap.sh twohost-cli-b -- cargo test -p spt --test twohost_cli -- --nocapture[0m
2026-08-29T06:04:53.3711074Z shell: /usr/bin/bash --noprofile --norc -e -o pipefail {0}
2026-08-29T06:04:53.3711365Z env:
2026-08-29T06:04:53.3711798Z   SPT_CI_TEST_TMP: /home/reavus/actions-runner/_work/_temp/spt-test-tmp-33236164340-1-iulC7F
2026-08-29T06:04:53.3712333Z   TEMP: /home/reavus/actions-runner/_work/_temp/spt-test-tmp-33236164340-1-iulC7F
2026-08-29T06:04:53.3712738Z   TMP: /home/reavus/actions-runner/_work/_temp/spt-test-tmp-33236164340-1-iulC7F
2026-08-29T06:04:53.3713144Z   TMPDIR: /home/reavus/actions-runner/_work/_temp/spt-test-tmp-33236164340-1-iulC7F
2026-08-29T06:04:53.3713473Z   SPT_TWO_HOST: 1
2026-08-29T06:04:53.3713653Z   SPT_TWO_HOST_ROLE: b
2026-08-29T06:04:53.3713857Z   SPT_TWO_HOST_SECRET: rig-twohost-ci
2026-08-29T06:04:53.3714079Z   SPT_TWO_HOST_WAIT_SECS: 900
2026-08-29T06:04:53.3714309Z ##[endgroup]
2026-08-29T06:04:53.6311631Z    Compiling n0-future v0.3.2
2026-08-29T06:04:53.6360423Z    Compiling rustix v1.1.4
2026-08-29T06:04:53.6387797Z    Compiling spt-store v0.65.0 (/home/reavus/actions-runner/_work/spt-bs-core/spt-bs-core/crates/spt-store)
2026-08-29T06:04:53.6452217Z    Compiling backon v1.6.0
2026-08-29T06:04:53.6776499Z    Compiling n0-watcher v0.6.1
2026-08-29T06:04:53.6777024Z    Compiling iroh-dns v0.98.0
2026-08-29T06:04:53.7869633Z    Compiling netwatch v0.16.0
2026-08-29T06:04:53.9243692Z    Compiling iroh-relay v0.98.0
2026-08-29T06:04:54.4064330Z    Compiling portmapper v0.16.0
2026-08-29T06:04:55.1408730Z    Compiling terminal_size v0.4.4
2026-08-29T06:04:55.1409398Z    Compiling tempfile v3.27.0
2026-08-29T06:04:55.1942459Z    Compiling clap_builder v4.6.0
2026-08-29T06:04:55.3140729Z    Compiling spt-test-support v0.65.0 (/home/reavus/actions-runner/_work/spt-bs-core/spt-bs-core/crates/spt-test-support)
2026-08-29T06:04:56.7084381Z    Compiling clap v4.6.1
2026-08-29T06:04:57.1729511Z    Compiling iroh v0.98.2
2026-08-29T06:04:57.6286304Z    Compiling spt-msg v0.65.0 (/home/reavus/actions-runner/_work/spt-bs-core/spt-bs-core/crates/spt-msg)
2026-08-29T06:04:57.7923313Z    Compiling spt-runtime v0.65.0 (/home/reavus/actions-runner/_work/spt-bs-core/spt-bs-core/crates/spt-runtime)
2026-08-29T06:04:57.7924037Z    Compiling spt-term v0.65.0 (/home/reavus/actions-runner/_work/spt-bs-core/spt-bs-core/crates/spt-term)
2026-08-29T06:04:59.7714712Z    Compiling spt-live v0.65.0 (/home/reavus/actions-runner/_work/spt-bs-core/spt-bs-core/crates/spt-live)
2026-08-29T06:05:05.7030019Z    Compiling spt-net v0.65.0 (/home/reavus/actions-runner/_work/spt-bs-core/spt-bs-core/crates/spt-net)
2026-08-29T06:05:07.6619575Z    Compiling spt-daemon v0.65.0 (/home/reavus/actions-runner/_work/spt-bs-core/spt-bs-core/crates/spt-daemon)
2026-08-29T06:05:18.5678351Z    Compiling spt v0.65.0 (/home/reavus/actions-runner/_work/spt-bs-core/spt-bs-core/crates/spt)
2026-08-29T06:05:25.7553525Z     Finished `test` profile [unoptimized + debuginfo] target(s) in 32.36s
2026-08-29T06:05:25.7784966Z      Running tests/twohost_cli.rs (target/debug/deps/twohost_cli-88c928e3a989c76b)
2026-08-29T06:05:25.7802080Z 
2026-08-29T06:05:25.7803701Z running 2 tests
2026-08-29T06:05:25.7804139Z test gated_cli_role_a ... ok
2026-08-29T06:05:25.7808382Z GATED role B: node 989b0dbaa74de8e5c747af19c65f49211f08235717e8d322ec082ab0cbfb48ee
2026-08-29T06:05:26.1954690Z MANIFEST_DEAD_KEY:gatedresume: [session.psyche_init] references `{psyche_dir}`, not a fillable key — this role is retired (never spawned); remove the dead reference
2026-08-29T06:05:35.9307835Z GATED role B: ticker session 1 ready
2026-08-29T06:05:49.9480121Z GATED OK: bring-up: A's target row replicated to B
2026-08-29T06:05:50.1984374Z GATED OK: C-2: A's wake flipped the rest intent to Active
2026-08-29T06:05:50.9485161Z GATED OK: C-2: the [session.resume] template relaunched the harness
2026-08-29T06:05:50.9486949Z GATED OK: C-2: the revived harness self-bound (status online)
2026-08-29T06:05:50.9487340Z GATED OK: C-2 revive (serve side)
2026-08-29T06:05:51.1190586Z GATED OK: E-1 send confirmed —  SELF_DETECT_AMBIGUOUS:3622232: endpoints ling-gated-e1, ling-gated-forkgap, ling-gated-forksrc all record process 3622232 as their owner, so this session cannot tell which one it is and will not guess. Messages carry the id you pass to --from. Bind each endpoint from its own session to make the sender resolvable.
2026-08-29T06:05:51.1192468Z SENT(WAN):ling-gated-tgt@cc45247c71dc683e9c6505b72142e1976f898f7acf064beb27e35d2993ace09c (spooled)
2026-08-29T06:06:25.7804588Z test gated_cli_role_b has been running for over 60 seconds
2026-08-29T06:20:51.3686418Z 
2026-08-29T06:20:51.3687488Z thread 'gated_cli_role_b' (3622235) panicked at crates/spt/tests/twohost_cli.rs:210:5:
2026-08-29T06:20:51.3688770Z never converged on the rig: E-1: A confirmed the from-stamp
2026-08-29T06:20:51.3690014Z note: run with `RUST_BACKTRACE=1` environment variable to display a backtrace
2026-08-29T06:20:51.4669672Z test gated_cli_role_b ... FAILED
2026-08-29T06:20:51.4670024Z 
2026-08-29T06:20:51.4670135Z failures:
2026-08-29T06:20:51.4670277Z 
2026-08-29T06:20:51.4670381Z failures:
2026-08-29T06:20:51.4670577Z     gated_cli_role_b
2026-08-29T06:20:51.4670730Z 
2026-08-29T06:20:51.4671001Z test result: FAILED. 1 passed; 1 failed; 0 ignored; 0 measured; 0 filtered out; finished in 925.69s
2026-08-29T06:20:51.4671399Z 
2026-08-29T06:20:51.4676777Z error: test failed, to rerun pass `-p spt --test twohost_cli`
2026-08-29T06:20:51.4914890Z ##[error]Process completed with exit code 101.
